您需要登录后才可以操作登录 | 立即注册
关闭
楼主
猪猪VS_

该用户从未签到

[打包相关] Upload file faild 老是提示这个错误。找不出原因不明白什么意思 [复制链接]

381 6 发表于 2018-10-11 20:04:21

Upload file faild  老是提示这个错误。找不出原因不明白什么意思,麻烦帮看一下啊。

日志如下:
[2018-10-11 19:47:05,240] DEBUG Thread-12151 //opt/applog//117/137/86/11713786-android - Thu Oct 11 19:47:05 CST 2018
[2018-10-11 19:47:05,481] DEBUG Thread-12150 //opt/applog//117/137/86/11713786-android - dos2unix: converting file //tmp/temp/0ilr7fXvFoGc/WebkitCorePalm//obfuscation.appcan to Unix format ...
[2018-10-11 19:47:05,494] DEBUG Thread-12151 //opt/applog//117/137/86/11713786-android - true
[2018-10-11 19:47:05,505] DEBUG Thread-12151 //opt/applog//117/137/86/11713786-android -
[2018-10-11 19:47:05,523] DEBUG Thread-12151 //opt/applog//117/137/86/11713786-android - false
[2018-10-11 19:47:05,523] DEBUG Thread-12151 //opt/applog//117/137/86/11713786-android - gradle build
[2018-10-11 19:47:06,528] DEBUG Thread-12151 //opt/applog//117/137/86/11713786-android - Updated local.properties
[2018-10-11 19:47:06,531] DEBUG Thread-12151 //opt/applog//117/137/86/11713786-android - Added file ./proguard-project.txt
[2018-10-11 19:47:15,771] DEBUG Thread-12151 //opt/applog//117/137/86/11713786-android - PREDEX DISABLED
[2018-10-11 19:47:19,414] DEBUG Thread-12151 //opt/applog//117/137/86/11713786-android - :clean UP-TO-DATE
[2018-10-11 19:47:19,427] DEBUG Thread-12151 //opt/applog//117/137/86/11713786-android - :clean took 4ms
[2018-10-11 19:47:19,433] DEBUG Thread-12151 //opt/applog//117/137/86/11713786-android - :preBuild UP-TO-DATE
[2018-10-11 19:47:19,439] DEBUG Thread-12151 //opt/applog//117/137/86/11713786-android - :preBuild took 0ms
[2018-10-11 19:47:19,440] DEBUG Thread-12151 //opt/applog//117/137/86/11713786-android - :preReleaseBuild UP-TO-DATE
[2018-10-11 19:47:19,441] DEBUG Thread-12151 //opt/applog//117/137/86/11713786-android - :preReleaseBuild took 0ms
[2018-10-11 19:47:19,444] DEBUG Thread-12151 //opt/applog//117/137/86/11713786-android - :checkReleaseManifest
[2018-10-11 19:47:19,444] DEBUG Thread-12151 //opt/applog//117/137/86/11713786-android - :checkReleaseManifest took 2ms
[2018-10-11 19:47:19,445] DEBUG Thread-12151 //opt/applog//117/137/86/11713786-android - :preDebugAndroidTestBuild UP-TO-DATE
[2018-10-11 19:47:19,446] DEBUG Thread-12151 //opt/applog//117/137/86/11713786-android - :preDebugAndroidTestBuild took 0ms
[2018-10-11 19:47:19,446] DEBUG Thread-12151 //opt/applog//117/137/86/11713786-android - :preDebugBuild UP-TO-DATE
[2018-10-11 19:47:19,447] DEBUG Thread-12151 //opt/applog//117/137/86/11713786-android - :preDebugBuild took 0ms
[2018-10-11 19:47:19,642] DEBUG Thread-12151 //opt/applog//117/137/86/11713786-android - :prepareComAndroidSupportMultidex101Library
[2018-10-11 19:47:19,652] DEBUG Thread-12151 //opt/applog//117/137/86/11713786-android - :prepareComAndroidSupportMultidex101Library took 194ms
[2018-10-11 19:47:19,654] DEBUG Thread-12151 //opt/applog//117/137/86/11713786-android - :prepareReleaseDependencies
[2018-10-11 19:47:19,661] DEBUG Thread-12151 //opt/applog//117/137/86/11713786-android - :prepareReleaseDependencies took 1ms
[2018-10-11 19:47:19,686] DEBUG Thread-12151 //opt/applog//117/137/86/11713786-android - :compileReleaseAidl
[2018-10-11 19:47:19,686] DEBUG Thread-12151 //opt/applog//117/137/86/11713786-android - :compileReleaseAidl took 24ms
[2018-10-11 19:47:19,765] DEBUG Thread-12151 //opt/applog//117/137/86/11713786-android - :compileReleaseRenderscript
[2018-10-11 19:47:19,765] DEBUG Thread-12151 //opt/applog//117/137/86/11713786-android - :compileReleaseRenderscript took 78ms
[2018-10-11 19:47:19,833] DEBUG Thread-12151 //opt/applog//117/137/86/11713786-android - :generateReleaseBuildConfig
[2018-10-11 19:47:19,834] DEBUG Thread-12151 //opt/applog//117/137/86/11713786-android - :generateReleaseBuildConfig took 68ms
[2018-10-11 19:47:19,834] DEBUG Thread-12151 //opt/applog//117/137/86/11713786-android - :generateReleaseAssets UP-TO-DATE
[2018-10-11 19:47:19,835] DEBUG Thread-12151 //opt/applog//117/137/86/11713786-android - :generateReleaseAssets took 0ms
[2018-10-11 19:47:22,819] DEBUG Thread-12151 //opt/applog//117/137/86/11713786-android - :mergeReleaseAssets
[2018-10-11 19:47:22,820] DEBUG Thread-12151 //opt/applog//117/137/86/11713786-android - :mergeReleaseAssets took 2984ms
[2018-10-11 19:47:22,826] DEBUG Thread-12151 //opt/applog//117/137/86/11713786-android - :generateReleaseResValues
[2018-10-11 19:47:22,826] DEBUG Thread-12151 //opt/applog//117/137/86/11713786-android - :generateReleaseResValues took 5ms
[2018-10-11 19:47:22,826] DEBUG Thread-12151 //opt/applog//117/137/86/11713786-android - :generateReleaseResources
[2018-10-11 19:47:22,826] DEBUG Thread-12151 //opt/applog//117/137/86/11713786-android - :generateReleaseResources took 0ms
[2018-10-11 19:47:24,537] DEBUG Thread-12151 //opt/applog//117/137/86/11713786-android - :mergeReleaseResources
[2018-10-11 19:47:24,538] DEBUG Thread-12151 //opt/applog//117/137/86/11713786-android - :mergeReleaseResources took 1710ms
[2018-10-11 19:47:24,768] DEBUG Thread-12151 //opt/applog//117/137/86/11713786-android - :processReleaseManifest
[2018-10-11 19:47:24,768] DEBUG Thread-12151 //opt/applog//117/137/86/11713786-android - Warning: /private/tmp/temp/0ilr7fXvFoGc/WebkitCorePalm/AndroidManifest.xml:330:1-61 Warning:
[2018-10-11 19:47:24,768] DEBUG Thread-12151 //opt/applog//117/137/86/11713786-android -         Element uses-permission#android.permission.VIBRATE at AndroidManifest.xml:330:1-61 duplicated with element declared at AndroidManifest.xml:322:5-65
[2018-10-11 19:47:24,768] DEBUG Thread-12151 //opt/applog//117/137/86/11713786-android - Warning: /private/tmp/temp/0ilr7fXvFoGc/WebkitCorePalm/AndroidManifest.xml:331:1-76 Warning:
[2018-10-11 19:47:24,768] DEBUG Thread-12151 //opt/applog//117/137/86/11713786-android -         Element uses-permission#android.permission.WRITE_EXTERNAL_STORAGE at AndroidManifest.xml:331:1-76 duplicated with element declared at AndroidManifest.xml:314:5-80
[2018-10-11 19:47:24,769] DEBUG Thread-12151 //opt/applog//117/137/86/11713786-android - Warning: /private/tmp/temp/0ilr7fXvFoGc/WebkitCorePalm/AndroidManifest.xml:333:1-63 Warning:
[2018-10-11 19:47:24,769] DEBUG Thread-12151 //opt/applog//117/137/86/11713786-android -         Element uses-permission#android.permission.WAKE_LOCK at AndroidManifest.xml:333:1-63 duplicated with element declared at AndroidManifest.xml:321:5-67
[2018-10-11 19:47:24,769] DEBUG Thread-12151 //opt/applog//117/137/86/11713786-android - Warning: /private/tmp/temp/0ilr7fXvFoGc/WebkitCorePalm/AndroidManifest.xml:338:1-74 Warning:
[2018-10-11 19:47:24,769] DEBUG Thread-12151 //opt/applog//117/137/86/11713786-android -         Element uses-permission#android.permission.ACCESS_NETWORK_STATE at AndroidManifest.xml:338:1-74 duplicated with element declared at AndroidManifest.xml:318:5-78
[2018-10-11 19:47:24,769] DEBUG Thread-12151 //opt/applog//117/137/86/11713786-android - Warning: /private/tmp/temp/0ilr7fXvFoGc/WebkitCorePalm/AndroidManifest.xml:339:1-62 Warning:
[2018-10-11 19:47:24,769] DEBUG Thread-12151 //opt/applog//117/137/86/11713786-android -         Element uses-permission#android.permission.INTERNET at AndroidManifest.xml:339:1-62 duplicated with element declared at AndroidManifest.xml:313:5-66
[2018-10-11 19:47:24,770] DEBUG Thread-12151 //opt/applog//117/137/86/11713786-android - Warning: /private/tmp/temp/0ilr7fXvFoGc/WebkitCorePalm/AndroidManifest.xml:341:1-71 Warning:
[2018-10-11 19:47:24,770] DEBUG Thread-12151 //opt/applog//117/137/86/11713786-android -         Element uses-permission#android.permission.ACCESS_WIFI_STATE at AndroidManifest.xml:341:1-71 duplicated with element declared at AndroidManifest.xml:316:5-75
[2018-10-11 19:47:24,770] DEBUG Thread-12151 //opt/applog//117/137/86/11713786-android - Warning: /private/tmp/temp/0ilr7fXvFoGc/WebkitCorePalm/AndroidManifest.xml:342:1-71 Warning:
[2018-10-11 19:47:24,770] DEBUG Thread-12151 //opt/applog//117/137/86/11713786-android -         Element uses-permission#android.permission.CHANGE_WIFI_STATE at AndroidManifest.xml:342:1-71 duplicated with element declared at AndroidManifest.xml:317:5-75
[2018-10-11 19:47:24,770] DEBUG Thread-12151 //opt/applog//117/137/86/11713786-android - Warning: /private/tmp/temp/0ilr7fXvFoGc/WebkitCorePalm/AndroidManifest.xml:344:1-70 Warning:
[2018-10-11 19:47:24,771] DEBUG Thread-12151 //opt/applog//117/137/86/11713786-android -         Element uses-permission#android.permission.READ_PHONE_STATE at AndroidManifest.xml:344:1-70 duplicated with element declared at AndroidManifest.xml:315:5-74
[2018-10-11 19:47:24,771] DEBUG Thread-12151 //opt/applog//117/137/86/11713786-android - Warning: /private/tmp/temp/0ilr7fXvFoGc/WebkitCorePalm/AndroidManifest.xml:352:1-63 Warning:
[2018-10-11 19:47:24,771] DEBUG Thread-12151 //opt/applog//117/137/86/11713786-android -         Element uses-permission#android.permission.READ_LOGS at AndroidManifest.xml:352:1-63 duplicated with element declared at AndroidManifest.xml:319:5-67
[2018-10-11 19:47:24,771] DEBUG Thread-12151 //opt/applog//117/137/86/11713786-android - Warning: /private/tmp/temp/0ilr7fXvFoGc/WebkitCorePalm/AndroidManifest.xml:353:1-76 Warning:
[2018-10-11 19:47:24,771] DEBUG Thread-12151 //opt/applog//117/137/86/11713786-android -         Element uses-permission#android.permission.RECEIVE_BOOT_COMPLETED at AndroidManifest.xml:353:1-76 duplicated with element declared at AndroidManifest.xml:320:5-80
[2018-10-11 19:47:24,794] DEBUG Thread-12151 //opt/applog//117/137/86/11713786-android - /private/tmp/temp/0ilr7fXvFoGc/WebkitCorePalm/AndroidManifest.xml:330:1-61 Warning:
[2018-10-11 19:47:24,794] DEBUG Thread-12151 //opt/applog//117/137/86/11713786-android -         Element uses-permission#android.permission.VIBRATE at AndroidManifest.xml:330:1-61 duplicated with element declared at AndroidManifest.xml:322:5-65
[2018-10-11 19:47:24,794] DEBUG Thread-12151 //opt/applog//117/137/86/11713786-android - /private/tmp/temp/0ilr7fXvFoGc/WebkitCorePalm/AndroidManifest.xml:331:1-76 Warning:
[2018-10-11 19:47:24,794] DEBUG Thread-12151 //opt/applog//117/137/86/11713786-android -         Element uses-permission#android.permission.WRITE_EXTERNAL_STORAGE at AndroidManifest.xml:331:1-76 duplicated with element declared at AndroidManifest.xml:314:5-80
[2018-10-11 19:47:24,794] DEBUG Thread-12151 //opt/applog//117/137/86/11713786-android - /private/tmp/temp/0ilr7fXvFoGc/WebkitCorePalm/AndroidManifest.xml:333:1-63 Warning:
[2018-10-11 19:47:24,794] DEBUG Thread-12151 //opt/applog//117/137/86/11713786-android -         Element uses-permission#android.permission.WAKE_LOCK at AndroidManifest.xml:333:1-63 duplicated with element declared at AndroidManifest.xml:321:5-67
[2018-10-11 19:47:24,794] DEBUG Thread-12151 //opt/applog//117/137/86/11713786-android - /private/tmp/temp/0ilr7fXvFoGc/WebkitCorePalm/AndroidManifest.xml:338:1-74 Warning:
[2018-10-11 19:47:24,795] DEBUG Thread-12151 //opt/applog//117/137/86/11713786-android -         Element uses-permission#android.permission.ACCESS_NETWORK_STATE at AndroidManifest.xml:338:1-74 duplicated with element declared at AndroidManifest.xml:318:5-78
[2018-10-11 19:47:24,795] DEBUG Thread-12151 //opt/applog//117/137/86/11713786-android - /private/tmp/temp/0ilr7fXvFoGc/WebkitCorePalm/AndroidManifest.xml:339:1-62 Warning:
[2018-10-11 19:47:24,795] DEBUG Thread-12151 //opt/applog//117/137/86/11713786-android -         Element uses-permission#android.permission.INTERNET at AndroidManifest.xml:339:1-62 duplicated with element declared at AndroidManifest.xml:313:5-66
[2018-10-11 19:47:24,795] DEBUG Thread-12151 //opt/applog//117/137/86/11713786-android - /private/tmp/temp/0ilr7fXvFoGc/WebkitCorePalm/AndroidManifest.xml:341:1-71 Warning:
[2018-10-11 19:47:24,795] DEBUG Thread-12151 //opt/applog//117/137/86/11713786-android -         Element uses-permission#android.permission.ACCESS_WIFI_STATE at AndroidManifest.xml:341:1-71 duplicated with element declared at AndroidManifest.xml:316:5-75
[2018-10-11 19:47:24,795] DEBUG Thread-12151 //opt/applog//117/137/86/11713786-android - /private/tmp/temp/0ilr7fXvFoGc/WebkitCorePalm/AndroidManifest.xml:342:1-71 Warning:
[2018-10-11 19:47:24,795] DEBUG Thread-12151 //opt/applog//117/137/86/11713786-android -         Element uses-permission#android.permission.CHANGE_WIFI_STATE at AndroidManifest.xml:342:1-71 duplicated with element declared at AndroidManifest.xml:317:5-75
[2018-10-11 19:47:24,795] DEBUG Thread-12151 //opt/applog//117/137/86/11713786-android - /private/tmp/temp/0ilr7fXvFoGc/WebkitCorePalm/AndroidManifest.xml:344:1-70 Warning:
[2018-10-11 19:47:24,795] DEBUG Thread-12151 //opt/applog//117/137/86/11713786-android -         Element uses-permission#android.permission.READ_PHONE_STATE at AndroidManifest.xml:344:1-70 duplicated with element declared at AndroidManifest.xml:315:5-74
[2018-10-11 19:47:24,795] DEBUG Thread-12151 //opt/applog//117/137/86/11713786-android - /private/tmp/temp/0ilr7fXvFoGc/WebkitCorePalm/AndroidManifest.xml:352:1-63 Warning:
[2018-10-11 19:47:24,795] DEBUG Thread-12151 //opt/applog//117/137/86/11713786-android -         Element uses-permission#android.permission.READ_LOGS at AndroidManifest.xml:352:1-63 duplicated with element declared at AndroidManifest.xml:319:5-67
[2018-10-11 19:47:24,796] DEBUG Thread-12151 //opt/applog//117/137/86/11713786-android - /private/tmp/temp/0ilr7fXvFoGc/WebkitCorePalm/AndroidManifest.xml:353:1-76 Warning:
[2018-10-11 19:47:24,796] DEBUG Thread-12151 //opt/applog//117/137/86/11713786-android -         Element uses-permission#android.permission.RECEIVE_BOOT_COMPLETED at AndroidManifest.xml:353:1-76 duplicated with element declared at AndroidManifest.xml:320:5-80
[2018-10-11 19:47:24,868] DEBUG Thread-12151 //opt/applog//117/137/86/11713786-android - :processReleaseManifest took 328ms
[2018-10-11 19:47:25,337] DEBUG Thread-12151 //opt/applog//117/137/86/11713786-android - :processReleaseResources
[2018-10-11 19:47:25,337] DEBUG Thread-12151 //opt/applog//117/137/86/11713786-android - /private/tmp/temp/0ilr7fXvFoGc/WebkitCorePalm/build/intermediates/res/merged/release/values-en/values-en.xml:55 : AAPT: warning: string 'pg_sdk_edit_crop_crop11' marked untranslatable but exists in locale 'en'
[2018-10-11 19:47:25,337] DEBUG Thread-12151 //opt/applog//117/137/86/11713786-android -
[2018-10-11 19:47:25,338] DEBUG Thread-12151 //opt/applog//117/137/86/11713786-android - /private/tmp/temp/0ilr7fXvFoGc/WebkitCorePalm/build/intermediates/res/merged/release/values-en/values-en.xml:56 : AAPT: warning: string 'pg_sdk_edit_crop_crop169' marked untranslatable but exists in locale 'en'
[2018-10-11 19:47:25,338] DEBUG Thread-12151 //opt/applog//117/137/86/11713786-android -
[2018-10-11 19:47:25,339] DEBUG Thread-12151 //opt/applog//117/137/86/11713786-android - /private/tmp/temp/0ilr7fXvFoGc/WebkitCorePalm/build/intermediates/res/merged/release/values-en/values-en.xml:57 : AAPT: warning: string 'pg_sdk_edit_crop_crop23' marked untranslatable but exists in locale 'en'
[2018-10-11 19:47:25,339] DEBUG Thread-12151 //opt/applog//117/137/86/11713786-android -
[2018-10-11 19:47:25,340] DEBUG Thread-12151 //opt/applog//117/137/86/11713786-android - /private/tmp/temp/0ilr7fXvFoGc/WebkitCorePalm/build/intermediates/res/merged/release/values-en/values-en.xml:58 : AAPT: warning: string 'pg_sdk_edit_crop_crop32' marked untranslatable but exists in locale 'en'
[2018-10-11 19:47:25,340] DEBUG Thread-12151 //opt/applog//117/137/86/11713786-android -
[2018-10-11 19:47:25,340] DEBUG Thread-12151 //opt/applog//117/137/86/11713786-android - /private/tmp/temp/0ilr7fXvFoGc/WebkitCorePalm/build/intermediates/res/merged/release/values-en/values-en.xml:59 : AAPT: warning: string 'pg_sdk_edit_crop_crop34' marked untranslatable but exists in locale 'en'
[2018-10-11 19:47:25,340] DEBUG Thread-12151 //opt/applog//117/137/86/11713786-android -
[2018-10-11 19:47:25,341] DEBUG Thread-12151 //opt/applog//117/137/86/11713786-android - /private/tmp/temp/0ilr7fXvFoGc/WebkitCorePalm/build/intermediates/res/merged/release/values-en/values-en.xml:60 : AAPT: warning: string 'pg_sdk_edit_crop_crop43' marked untranslatable but exists in locale 'en'
[2018-10-11 19:47:25,341] DEBUG Thread-12151 //opt/applog//117/137/86/11713786-android -
[2018-10-11 19:47:25,342] DEBUG Thread-12151 //opt/applog//117/137/86/11713786-android - /private/tmp/temp/0ilr7fXvFoGc/WebkitCorePalm/build/intermediates/res/merged/release/values-en/values-en.xml:63 : AAPT: warning: string 'pg_sdk_edit_crop_crop916' marked untranslatable but exists in locale 'en'
[2018-10-11 19:47:25,342] DEBUG Thread-12151 //opt/applog//117/137/86/11713786-android -
[2018-10-11 19:47:25,343] DEBUG Thread-12150 //opt/applog//117/137/86/11713786-android - /private/tmp/temp/0ilr7fXvFoGc/WebkitCorePalm/build/intermediates/manifests/full/release/AndroidManifest.xml:51 : AAPT: Tag <uses-permission> attribute name has invalid character '$'.
[2018-10-11 19:47:25,343] DEBUG Thread-12150 //opt/applog//117/137/86/11713786-android -
[2018-10-11 19:47:25,343] DEBUG Thread-12150 //opt/applog//117/137/86/11713786-android - /private/tmp/temp/0ilr7fXvFoGc/WebkitCorePalm/build/intermediates/manifests/full/release/AndroidManifest.xml:61 : AAPT: Tag <permission> attribute name has invalid character '$'.
[2018-10-11 19:47:25,343] DEBUG Thread-12150 //opt/applog//117/137/86/11713786-android -
[2018-10-11 19:47:25,343] DEBUG Thread-12150 //opt/applog//117/137/86/11713786-android - /private/tmp/temp/0ilr7fXvFoGc/WebkitCorePalm/build/intermediates/manifests/full/release/AndroidManifest.xml:195 : AAPT: Tag <category> attribute name has invalid character '$'.
[2018-10-11 19:47:25,343] DEBUG Thread-12150 //opt/applog//117/137/86/11713786-android -
[2018-10-11 19:47:25,343] DEBUG Thread-12150 //opt/applog//117/137/86/11713786-android - /private/tmp/temp/0ilr7fXvFoGc/WebkitCorePalm/build/intermediates/manifests/full/release/AndroidManifest.xml:270 : AAPT: Tag <category> attribute name has invalid character '$'.
[2018-10-11 19:47:25,343] DEBUG Thread-12150 //opt/applog//117/137/86/11713786-android -
[2018-10-11 19:47:25,343] DEBUG Thread-12150 //opt/applog//117/137/86/11713786-android - /private/tmp/temp/0ilr7fXvFoGc/WebkitCorePalm/build/intermediates/manifests/full/release/AndroidManifest.xml:283 : AAPT: Tag <provider> attribute authorities has invalid character '$'.
[2018-10-11 19:47:25,343] DEBUG Thread-12150 //opt/applog//117/137/86/11713786-android -
[2018-10-11 19:47:25,344] DEBUG Thread-12150 //opt/applog//117/137/86/11713786-android - /private/tmp/temp/0ilr7fXvFoGc/WebkitCorePalm/build/intermediates/manifests/full/release/AndroidManifest.xml:287 : AAPT: Tag <provider> attribute authorities has invalid character '$'.
[2018-10-11 19:47:25,344] DEBUG Thread-12150 //opt/applog//117/137/86/11713786-android -
[2018-10-11 19:47:25,344] DEBUG Thread-12150 //opt/applog//117/137/86/11713786-android - /private/tmp/temp/0ilr7fXvFoGc/WebkitCorePalm/build/intermediates/manifests/full/release/AndroidManifest.xml:305 : AAPT: Tag <category> attribute name has invalid character '$'.
[2018-10-11 19:47:25,344] DEBUG Thread-12150 //opt/applog//117/137/86/11713786-android -
[2018-10-11 19:47:25,344] DEBUG Thread-12150 //opt/applog//117/137/86/11713786-android - /private/tmp/temp/0ilr7fXvFoGc/WebkitCorePalm/build/intermediates/manifests/full/release/AndroidManifest.xml:345 : AAPT: Tag <category> attribute name has invalid character '$'.
[2018-10-11 19:47:25,344] DEBUG Thread-12150 //opt/applog//117/137/86/11713786-android -
[2018-10-11 19:47:25,346] DEBUG Thread-12151 //opt/applog//117/137/86/11713786-android - :processReleaseResources FAILED
[2018-10-11 19:47:25,346] DEBUG Thread-12151 //opt/applog//117/137/86/11713786-android - :processReleaseResources took 478ms
[2018-10-11 19:47:25,353] DEBUG Thread-12150 //opt/applog//117/137/86/11713786-android -
[2018-10-11 19:47:25,354] DEBUG Thread-12150 //opt/applog//117/137/86/11713786-android - FAILURE: Build failed with an exception.
[2018-10-11 19:47:25,354] DEBUG Thread-12150 //opt/applog//117/137/86/11713786-android -
[2018-10-11 19:47:25,354] DEBUG Thread-12150 //opt/applog//117/137/86/11713786-android - * What went wrong:
[2018-10-11 19:47:25,354] DEBUG Thread-12150 //opt/applog//117/137/86/11713786-android - Execution failed for task ':processReleaseResources'.
[2018-10-11 19:47:25,354] DEBUG Thread-12150 //opt/applog//117/137/86/11713786-android - > com.android.ide.common.process.Proces**ception: org.gradle.process.internal.ExecException: Process 'command '/opt/local/share/android-sdk-macosx/build-tools/23.0.1/aapt'' finished with non-zero exit value 1
[2018-10-11 19:47:25,355] DEBUG Thread-12150 //opt/applog//117/137/86/11713786-android -
[2018-10-11 19:47:25,355] DEBUG Thread-12150 //opt/applog//117/137/86/11713786-android - * Try:
[2018-10-11 19:47:25,355] DEBUG Thread-12150 //opt/applog//117/137/86/11713786-android - Run with --stacktrace option to get the stack trace. Run with --info or --debug option to get more log output.
[2018-10-11 19:47:25,356] DEBUG Thread-12151 //opt/applog//117/137/86/11713786-android -
[2018-10-11 19:47:25,356] DEBUG Thread-12151 //opt/applog//117/137/86/11713786-android - BUILD FAILED
[2018-10-11 19:47:25,356] DEBUG Thread-12151 //opt/applog//117/137/86/11713786-android -
[2018-10-11 19:47:25,356] DEBUG Thread-12151 //opt/applog//117/137/86/11713786-android - Total time: 17.873 secs
[2018-10-11 19:47:25,358] DEBUG Thread-12151 //opt/applog//117/137/86/11713786-android - Task timings:
[2018-10-11 19:47:25,361] DEBUG Thread-12151 //opt/applog//117/137/86/11713786-android -     194ms  :prepareComAndroidSupportMultidex101Library
[2018-10-11 19:47:25,362] DEBUG Thread-12151 //opt/applog//117/137/86/11713786-android -      78ms  :compileReleaseRenderscript
[2018-10-11 19:47:25,362] DEBUG Thread-12151 //opt/applog//117/137/86/11713786-android -      68ms  :generateReleaseBuildConfig
[2018-10-11 19:47:25,362] DEBUG Thread-12151 //opt/applog//117/137/86/11713786-android -    2984ms  :mergeReleaseAssets
[2018-10-11 19:47:25,363] DEBUG Thread-12151 //opt/applog//117/137/86/11713786-android -    1710ms  :mergeReleaseResources
[2018-10-11 19:47:25,363] DEBUG Thread-12151 //opt/applog//117/137/86/11713786-android -     328ms  :processReleaseManifest
[2018-10-11 19:47:25,363] DEBUG Thread-12151 //opt/applog//117/137/86/11713786-android -     478ms  :processReleaseResources
[2018-10-11 19:47:26,604] DEBUG Thread-12150 //opt/applog//117/137/86/11713786-android - cp: //tmp/temp/0ilr7fXvFoGc/WebkitCorePalm//build/outputs/apk/WebkitCorePalm-release-unsigned.apk: No such file or directory
[2018-10-11 19:47:26,614] DEBUG Thread-12151 //opt/applog//117/137/86/11713786-android - Thu Oct 11 19:47:26 CST 2018
[2018-10-11 19:47:27,167] DEBUG Thread-12161 //opt/applog//117/137/86/11713786-android - jarsigner: ???? jar ??: //tmp/temp/0ilr7fXvFoGc/widgetone.apk
[2018-10-11 19:47:27,237] DEBUG Thread-12162 //opt/applog//117/137/86/11713786-android - Unable to open '//tmp/temp/0ilr7fXvFoGc/widgetone.apk' as zip archive


沙发
猪猪VS_

该用户从未签到

显示全部楼层 发表于 2018-10-11 20:24:16
苹果能打包成功,安卓不行。是怎么回事啊?

项目引擎:sdksuit_4.1_180426_01(官方引擎)7
公共插件:uexCall,uexCamera,uexCamera360,uexContact,uexDataBaseMgr,uexDevice,uexDocumentReader,uexDownloaderMgr,uexESurfingRtc,uexImageBrowser,uexJPush,uexLocation,uexScanner,uexSensor,uexSlidePager,uexSMS,uexUploaderMgr,uexVideo,uexWebSocket,uexWeiXin,uexXmlHttpMgr,uexDataAnalysis,uexUpdate,
板凳
AppCan运营
  • TA的每日心情
    开心
    2018-6-6 14:54
  • 签到天数: 128 天

    连续签到: 1 天

    [LV.7]常住居民III

    显示全部楼层 发表于 2018-10-15 10:35:31
    请检查下项目中是否有中文命名的文件?
    地板
    猪猪VS_

    该用户从未签到

    显示全部楼层 发表于 2018-10-25 14:08:52
    中文检查过呢。你们给的打包不成功的文档我看了。都排除了。没找到原因,急人啊
    5#
    AppCan运营
  • TA的每日心情
    开心
    2018-6-6 14:54
  • 签到天数: 128 天

    连续签到: 1 天

    [LV.7]常住居民III

    显示全部楼层 发表于 2018-10-25 16:01:57
    您勾选那么多插件的,都用的着么?
    6#
    菩萨保佑平安

    该用户从未签到

    显示全部楼层 发表于 2018-11-23 08:27:01
    类似的问题,线上打包不成功,什么插件都没勾选
    [2018-11-23 08:20:53,719] DEBUG Thread-365 //opt/applog//117/245/04/11724504-android - Fri Nov 23 08:20:53 CST 2018
    [2018-11-23 08:20:53,977] DEBUG Thread-364 //opt/applog//117/245/04/11724504-android - dos2unix: converting file //ram_disk/temp/WYcJOsxC4OyH/WebkitCorePalm//obfuscation.appcan to Unix format ...
    [2018-11-23 08:20:53,997] DEBUG Thread-365 //opt/applog//117/245/04/11724504-android - true
    [2018-11-23 08:20:54,013] DEBUG Thread-365 //opt/applog//117/245/04/11724504-android -
    [2018-11-23 08:20:54,044] DEBUG Thread-365 //opt/applog//117/245/04/11724504-android - false
    [2018-11-23 08:20:54,044] DEBUG Thread-365 //opt/applog//117/245/04/11724504-android - gradle build
    [2018-11-23 08:20:55,181] DEBUG Thread-365 //opt/applog//117/245/04/11724504-android - Updated local.properties
    [2018-11-23 08:20:55,185] DEBUG Thread-365 //opt/applog//117/245/04/11724504-android - Added file ./proguard-project.txt
    [2018-11-23 08:21:07,794] DEBUG Thread-365 //opt/applog//117/245/04/11724504-android - PREDEX DISABLED
    [2018-11-23 08:21:12,211] DEBUG Thread-365 //opt/applog//117/245/04/11724504-android - :clean UP-TO-DATE
    [2018-11-23 08:21:12,232] DEBUG Thread-365 //opt/applog//117/245/04/11724504-android - :clean took 3ms
    [2018-11-23 08:21:12,245] DEBUG Thread-365 //opt/applog//117/245/04/11724504-android - :preBuild UP-TO-DATE
    [2018-11-23 08:21:12,250] DEBUG Thread-365 //opt/applog//117/245/04/11724504-android - :preBuild took 0ms
    [2018-11-23 08:21:12,251] DEBUG Thread-365 //opt/applog//117/245/04/11724504-android - :preReleaseBuild UP-TO-DATE
    [2018-11-23 08:21:12,251] DEBUG Thread-365 //opt/applog//117/245/04/11724504-android - :preReleaseBuild took 1ms
    [2018-11-23 08:21:12,253] DEBUG Thread-365 //opt/applog//117/245/04/11724504-android - :checkReleaseManifest
    [2018-11-23 08:21:12,253] DEBUG Thread-365 //opt/applog//117/245/04/11724504-android - :checkReleaseManifest took 2ms
    [2018-11-23 08:21:12,257] DEBUG Thread-365 //opt/applog//117/245/04/11724504-android - :preDebugAndroidTestBuild UP-TO-DATE
    [2018-11-23 08:21:12,258] DEBUG Thread-365 //opt/applog//117/245/04/11724504-android - :preDebugAndroidTestBuild took 0ms
    [2018-11-23 08:21:12,258] DEBUG Thread-365 //opt/applog//117/245/04/11724504-android - :preDebugBuild UP-TO-DATE
    [2018-11-23 08:21:12,259] DEBUG Thread-365 //opt/applog//117/245/04/11724504-android - :preDebugBuild took 0ms
    [2018-11-23 08:21:12,476] DEBUG Thread-365 //opt/applog//117/245/04/11724504-android - :prepareComAndroidSupportMultidex101Library
    [2018-11-23 08:21:12,489] DEBUG Thread-365 //opt/applog//117/245/04/11724504-android - :prepareComAndroidSupportMultidex101Library took 224ms
    [2018-11-23 08:21:12,490] DEBUG Thread-365 //opt/applog//117/245/04/11724504-android - :prepareReleaseDependencies
    [2018-11-23 08:21:12,499] DEBUG Thread-365 //opt/applog//117/245/04/11724504-android - :prepareReleaseDependencies took 1ms
    [2018-11-23 08:21:12,539] DEBUG Thread-365 //opt/applog//117/245/04/11724504-android - :compileReleaseAidl
    [2018-11-23 08:21:12,540] DEBUG Thread-365 //opt/applog//117/245/04/11724504-android - :compileReleaseAidl took 40ms
    [2018-11-23 08:21:12,647] DEBUG Thread-365 //opt/applog//117/245/04/11724504-android - :compileReleaseRenderscript
    [2018-11-23 08:21:12,648] DEBUG Thread-365 //opt/applog//117/245/04/11724504-android - :compileReleaseRenderscript took 108ms
    [2018-11-23 08:21:12,713] DEBUG Thread-365 //opt/applog//117/245/04/11724504-android - :generateReleaseBuildConfig
    [2018-11-23 08:21:12,718] DEBUG Thread-365 //opt/applog//117/245/04/11724504-android - :generateReleaseBuildConfig took 69ms
    [2018-11-23 08:21:12,719] DEBUG Thread-365 //opt/applog//117/245/04/11724504-android - :generateReleaseAssets UP-TO-DATE
    [2018-11-23 08:21:12,719] DEBUG Thread-365 //opt/applog//117/245/04/11724504-android - :generateReleaseAssets took 1ms
    [2018-11-23 08:21:18,205] DEBUG Thread-365 //opt/applog//117/245/04/11724504-android - :mergeReleaseAssets
    [2018-11-23 08:21:18,205] DEBUG Thread-365 //opt/applog//117/245/04/11724504-android - :mergeReleaseAssets took 5485ms
    [2018-11-23 08:21:18,210] DEBUG Thread-365 //opt/applog//117/245/04/11724504-android - :generateReleaseResValues
    [2018-11-23 08:21:18,210] DEBUG Thread-365 //opt/applog//117/245/04/11724504-android - :generateReleaseResValues took 5ms
    [2018-11-23 08:21:18,211] DEBUG Thread-365 //opt/applog//117/245/04/11724504-android - :generateReleaseResources
    [2018-11-23 08:21:18,211] DEBUG Thread-365 //opt/applog//117/245/04/11724504-android - :generateReleaseResources took 1ms
    [2018-11-23 08:21:18,825] DEBUG Thread-365 //opt/applog//117/245/04/11724504-android - :mergeReleaseResources
    [2018-11-23 08:21:18,829] DEBUG Thread-365 //opt/applog//117/245/04/11724504-android - :mergeReleaseResources took 614ms
    [2018-11-23 08:21:18,924] DEBUG Thread-365 //opt/applog//117/245/04/11724504-android - :processReleaseManifest
    [2018-11-23 08:21:18,925] DEBUG Thread-365 //opt/applog//117/245/04/11724504-android - Warning: /ram_disk/temp/WYcJOsxC4OyH/WebkitCorePalm/AndroidManifest.xml:188:1-61 Warning:
    [2018-11-23 08:21:18,925] DEBUG Thread-365 //opt/applog//117/245/04/11724504-android -         Element uses-permission#android.permission.VIBRATE at AndroidManifest.xml:188:1-61 duplicated with element declared at AndroidManifest.xml:184:5-65
    [2018-11-23 08:21:18,925] DEBUG Thread-365 //opt/applog//117/245/04/11724504-android - Warning: /ram_disk/temp/WYcJOsxC4OyH/WebkitCorePalm/AndroidManifest.xml:189:1-76 Warning:
    [2018-11-23 08:21:18,925] DEBUG Thread-365 //opt/applog//117/245/04/11724504-android -         Element uses-permission#android.permission.WRITE_EXTERNAL_STORAGE at AndroidManifest.xml:189:1-76 duplicated with element declared at AndroidManifest.xml:176:5-80
    [2018-11-23 08:21:18,925] DEBUG Thread-365 //opt/applog//117/245/04/11724504-android - Warning: /ram_disk/temp/WYcJOsxC4OyH/WebkitCorePalm/AndroidManifest.xml:191:1-63 Warning:
    [2018-11-23 08:21:18,925] DEBUG Thread-365 //opt/applog//117/245/04/11724504-android -         Element uses-permission#android.permission.WAKE_LOCK at AndroidManifest.xml:191:1-63 duplicated with element declared at AndroidManifest.xml:183:5-67
    [2018-11-23 08:21:18,925] DEBUG Thread-365 //opt/applog//117/245/04/11724504-android - Warning: /ram_disk/temp/WYcJOsxC4OyH/WebkitCorePalm/AndroidManifest.xml:196:1-74 Warning:
    [2018-11-23 08:21:18,926] DEBUG Thread-365 //opt/applog//117/245/04/11724504-android -         Element uses-permission#android.permission.ACCESS_NETWORK_STATE at AndroidManifest.xml:196:1-74 duplicated with element declared at AndroidManifest.xml:180:5-78
    [2018-11-23 08:21:18,926] DEBUG Thread-365 //opt/applog//117/245/04/11724504-android - Warning: /ram_disk/temp/WYcJOsxC4OyH/WebkitCorePalm/AndroidManifest.xml:197:1-62 Warning:
    [2018-11-23 08:21:18,926] DEBUG Thread-365 //opt/applog//117/245/04/11724504-android -         Element uses-permission#android.permission.INTERNET at AndroidManifest.xml:197:1-62 duplicated with element declared at AndroidManifest.xml:175:5-66
    [2018-11-23 08:21:18,926] DEBUG Thread-365 //opt/applog//117/245/04/11724504-android - Warning: /ram_disk/temp/WYcJOsxC4OyH/WebkitCorePalm/AndroidManifest.xml:200:1-70 Warning:
    [2018-11-23 08:21:18,926] DEBUG Thread-365 //opt/applog//117/245/04/11724504-android -         Element uses-permission#android.permission.READ_PHONE_STATE at AndroidManifest.xml:200:1-70 duplicated with element declared at AndroidManifest.xml:177:5-74
    [2018-11-23 08:21:18,926] DEBUG Thread-365 //opt/applog//117/245/04/11724504-android - Warning: /ram_disk/temp/WYcJOsxC4OyH/WebkitCorePalm/AndroidManifest.xml:202:1-71 Warning:
    [2018-11-23 08:21:18,926] DEBUG Thread-365 //opt/applog//117/245/04/11724504-android -         Element uses-permission#android.permission.ACCESS_WIFI_STATE at AndroidManifest.xml:202:1-71 duplicated with element declared at AndroidManifest.xml:178:5-75
    [2018-11-23 08:21:18,927] DEBUG Thread-365 //opt/applog//117/245/04/11724504-android - Warning: /ram_disk/temp/WYcJOsxC4OyH/WebkitCorePalm/AndroidManifest.xml:205:1-71 Warning:
    [2018-11-23 08:21:18,927] DEBUG Thread-365 //opt/applog//117/245/04/11724504-android -         Element uses-permission#android.permission.CHANGE_WIFI_STATE at AndroidManifest.xml:205:1-71 duplicated with element declared at AndroidManifest.xml:179:5-75
    [2018-11-23 08:21:18,943] DEBUG Thread-365 //opt/applog//117/245/04/11724504-android - /ram_disk/temp/WYcJOsxC4OyH/WebkitCorePalm/AndroidManifest.xml:188:1-61 Warning:
    [2018-11-23 08:21:18,944] DEBUG Thread-365 //opt/applog//117/245/04/11724504-android -         Element uses-permission#android.permission.VIBRATE at AndroidManifest.xml:188:1-61 duplicated with element declared at AndroidManifest.xml:184:5-65
    [2018-11-23 08:21:18,944] DEBUG Thread-365 //opt/applog//117/245/04/11724504-android - /ram_disk/temp/WYcJOsxC4OyH/WebkitCorePalm/AndroidManifest.xml:189:1-76 Warning:
    [2018-11-23 08:21:18,944] DEBUG Thread-365 //opt/applog//117/245/04/11724504-android -         Element uses-permission#android.permission.WRITE_EXTERNAL_STORAGE at AndroidManifest.xml:189:1-76 duplicated with element declared at AndroidManifest.xml:176:5-80
    [2018-11-23 08:21:18,944] DEBUG Thread-365 //opt/applog//117/245/04/11724504-android - /ram_disk/temp/WYcJOsxC4OyH/WebkitCorePalm/AndroidManifest.xml:191:1-63 Warning:
    [2018-11-23 08:21:18,945] DEBUG Thread-365 //opt/applog//117/245/04/11724504-android -         Element uses-permission#android.permission.WAKE_LOCK at AndroidManifest.xml:191:1-63 duplicated with element declared at AndroidManifest.xml:183:5-67
    [2018-11-23 08:21:18,945] DEBUG Thread-365 //opt/applog//117/245/04/11724504-android - /ram_disk/temp/WYcJOsxC4OyH/WebkitCorePalm/AndroidManifest.xml:196:1-74 Warning:
    [2018-11-23 08:21:18,945] DEBUG Thread-365 //opt/applog//117/245/04/11724504-android -         Element uses-permission#android.permission.ACCESS_NETWORK_STATE at AndroidManifest.xml:196:1-74 duplicated with element declared at AndroidManifest.xml:180:5-78
    [2018-11-23 08:21:18,945] DEBUG Thread-365 //opt/applog//117/245/04/11724504-android - /ram_disk/temp/WYcJOsxC4OyH/WebkitCorePalm/AndroidManifest.xml:197:1-62 Warning:
    [2018-11-23 08:21:18,945] DEBUG Thread-365 //opt/applog//117/245/04/11724504-android -         Element uses-permission#android.permission.INTERNET at AndroidManifest.xml:197:1-62 duplicated with element declared at AndroidManifest.xml:175:5-66
    [2018-11-23 08:21:18,946] DEBUG Thread-365 //opt/applog//117/245/04/11724504-android - /ram_disk/temp/WYcJOsxC4OyH/WebkitCorePalm/AndroidManifest.xml:200:1-70 Warning:
    [2018-11-23 08:21:18,946] DEBUG Thread-365 //opt/applog//117/245/04/11724504-android -         Element uses-permission#android.permission.READ_PHONE_STATE at AndroidManifest.xml:200:1-70 duplicated with element declared at AndroidManifest.xml:177:5-74
    [2018-11-23 08:21:18,946] DEBUG Thread-365 //opt/applog//117/245/04/11724504-android - /ram_disk/temp/WYcJOsxC4OyH/WebkitCorePalm/AndroidManifest.xml:202:1-71 Warning:
    [2018-11-23 08:21:18,946] DEBUG Thread-365 //opt/applog//117/245/04/11724504-android -         Element uses-permission#android.permission.ACCESS_WIFI_STATE at AndroidManifest.xml:202:1-71 duplicated with element declared at AndroidManifest.xml:178:5-75
    [2018-11-23 08:21:18,946] DEBUG Thread-365 //opt/applog//117/245/04/11724504-android - /ram_disk/temp/WYcJOsxC4OyH/WebkitCorePalm/AndroidManifest.xml:205:1-71 Warning:
    [2018-11-23 08:21:18,947] DEBUG Thread-365 //opt/applog//117/245/04/11724504-android -         Element uses-permission#android.permission.CHANGE_WIFI_STATE at AndroidManifest.xml:205:1-71 duplicated with element declared at AndroidManifest.xml:179:5-75
    [2018-11-23 08:21:19,037] DEBUG Thread-365 //opt/applog//117/245/04/11724504-android - :processReleaseManifest took 197ms
    [2018-11-23 08:21:19,488] DEBUG Thread-364 //opt/applog//117/245/04/11724504-android - /ram_disk/temp/WYcJOsxC4OyH/WebkitCorePalm/build/intermediates/manifests/full/release/AndroidManifest.xml:42 : AAPT: Tag <uses-permission> attribute name has invalid character '$'.
    [2018-11-23 08:21:19,488] DEBUG Thread-364 //opt/applog//117/245/04/11724504-android -
    [2018-11-23 08:21:19,489] DEBUG Thread-364 //opt/applog//117/245/04/11724504-android - /ram_disk/temp/WYcJOsxC4OyH/WebkitCorePalm/build/intermediates/manifests/full/release/AndroidManifest.xml:55 : AAPT: Tag <permission> attribute name has invalid character '$'.
    [2018-11-23 08:21:19,489] DEBUG Thread-364 //opt/applog//117/245/04/11724504-android -
    [2018-11-23 08:21:19,489] DEBUG Thread-364 //opt/applog//117/245/04/11724504-android - /ram_disk/temp/WYcJOsxC4OyH/WebkitCorePalm/build/intermediates/manifests/full/release/AndroidManifest.xml:145 : AAPT: Tag <category> attribute name has invalid character '$'.
    [2018-11-23 08:21:19,489] DEBUG Thread-364 //opt/applog//117/245/04/11724504-android -
    [2018-11-23 08:21:19,489] DEBUG Thread-364 //opt/applog//117/245/04/11724504-android - /ram_disk/temp/WYcJOsxC4OyH/WebkitCorePalm/build/intermediates/manifests/full/release/AndroidManifest.xml:175 : AAPT: Tag <category> attribute name has invalid character '$'.
    [2018-11-23 08:21:19,489] DEBUG Thread-364 //opt/applog//117/245/04/11724504-android -
    [2018-11-23 08:21:19,490] DEBUG Thread-364 //opt/applog//117/245/04/11724504-android - /ram_disk/temp/WYcJOsxC4OyH/WebkitCorePalm/build/intermediates/manifests/full/release/AndroidManifest.xml:187 : AAPT: Tag <category> attribute name has invalid character '$'.
    [2018-11-23 08:21:19,490] DEBUG Thread-364 //opt/applog//117/245/04/11724504-android -
    [2018-11-23 08:21:19,490] DEBUG Thread-364 //opt/applog//117/245/04/11724504-android - /ram_disk/temp/WYcJOsxC4OyH/WebkitCorePalm/build/intermediates/manifests/full/release/AndroidManifest.xml:227 : AAPT: Tag <category> attribute name has invalid character '$'.
    [2018-11-23 08:21:19,490] DEBUG Thread-364 //opt/applog//117/245/04/11724504-android -
    [2018-11-23 08:21:19,492] DEBUG Thread-365 //opt/applog//117/245/04/11724504-android - :processReleaseResources FAILED
    [2018-11-23 08:21:19,493] DEBUG Thread-365 //opt/applog//117/245/04/11724504-android - :processReleaseResources took 456ms
    [2018-11-23 08:21:19,501] DEBUG Thread-364 //opt/applog//117/245/04/11724504-android -
    [2018-11-23 08:21:19,501] DEBUG Thread-364 //opt/applog//117/245/04/11724504-android - FAILURE: Build failed with an exception.
    [2018-11-23 08:21:19,502] DEBUG Thread-364 //opt/applog//117/245/04/11724504-android -
    [2018-11-23 08:21:19,502] DEBUG Thread-364 //opt/applog//117/245/04/11724504-android - * What went wrong:
    [2018-11-23 08:21:19,502] DEBUG Thread-364 //opt/applog//117/245/04/11724504-android - Execution failed for task ':processReleaseResources'.
    [2018-11-23 08:21:19,502] DEBUG Thread-364 //opt/applog//117/245/04/11724504-android - > com.android.ide.common.process.Proces**ception: org.gradle.process.internal.ExecException: Process 'command '/opt/local/share/android-sdk-macosx/build-tools/23.0.1/aapt'' finished with non-zero exit value 1
    [2018-11-23 08:21:19,502] DEBUG Thread-364 //opt/applog//117/245/04/11724504-android -
    [2018-11-23 08:21:19,502] DEBUG Thread-364 //opt/applog//117/245/04/11724504-android - * Try:
    [2018-11-23 08:21:19,502] DEBUG Thread-364 //opt/applog//117/245/04/11724504-android - Run with --stacktrace option to get the stack trace. Run with --info or --debug option to get more log output.
    [2018-11-23 08:21:19,503] DEBUG Thread-365 //opt/applog//117/245/04/11724504-android -
    [2018-11-23 08:21:19,503] DEBUG Thread-365 //opt/applog//117/245/04/11724504-android - BUILD FAILED
    [2018-11-23 08:21:19,503] DEBUG Thread-365 //opt/applog//117/245/04/11724504-android -
    [2018-11-23 08:21:19,503] DEBUG Thread-365 //opt/applog//117/245/04/11724504-android - Total time: 23.148 secs
    [2018-11-23 08:21:19,504] DEBUG Thread-365 //opt/applog//117/245/04/11724504-android - Task timings:
    [2018-11-23 08:21:19,508] DEBUG Thread-365 //opt/applog//117/245/04/11724504-android -     224ms  :prepareComAndroidSupportMultidex101Library
    [2018-11-23 08:21:19,508] DEBUG Thread-365 //opt/applog//117/245/04/11724504-android -     108ms  :compileReleaseRenderscript
    [2018-11-23 08:21:19,508] DEBUG Thread-365 //opt/applog//117/245/04/11724504-android -      69ms  :generateReleaseBuildConfig
    [2018-11-23 08:21:19,508] DEBUG Thread-365 //opt/applog//117/245/04/11724504-android -    5485ms  :mergeReleaseAssets
    [2018-11-23 08:21:19,508] DEBUG Thread-365 //opt/applog//117/245/04/11724504-android -     614ms  :mergeReleaseResources
    [2018-11-23 08:21:19,509] DEBUG Thread-365 //opt/applog//117/245/04/11724504-android -     197ms  :processReleaseManifest
    [2018-11-23 08:21:19,509] DEBUG Thread-365 //opt/applog//117/245/04/11724504-android -     456ms  :processReleaseResources
    [2018-11-23 08:21:20,183] DEBUG Thread-364 //opt/applog//117/245/04/11724504-android - cp: //ram_disk/temp/WYcJOsxC4OyH/WebkitCorePalm//build/outputs/apk/WebkitCorePalm-release-unsigned.apk: No such file or directory
    [2018-11-23 08:21:20,195] DEBUG Thread-365 //opt/applog//117/245/04/11724504-android - Fri Nov 23 08:21:20 CST 2018
    [2018-11-23 08:21:20,768] DEBUG SimpleAsyncTaskExecutor-1 //opt/applog//117/245/04/11724504-android - jarsigner: ???? jar ??: //ram_disk/temp/WYcJOsxC4OyH/widgetone.apk

    7#
    菩萨保佑平安

    该用户从未签到

    显示全部楼层 发表于 2018-11-23 08:27:55
    本地打包可以,线上就是不行,问题太多。。。
    主题:
    级别:游客
    发帖:
    您需要登录后才可以回帖 登录 | 立即注册

    本版积分规则

    快速回复 返回顶部 返回列表